{"text_format":"2","workbook":"xlsx","n_sheets":3,"sheets":["General Instructions","Summary","FMS Diagnostic Review Tool"],"not_rendered":{"charts":0,"images":1,"macros":0,"external_links":4,"defined_names":16,"comments":0,"pivot_tables":0},"unopened":[],"bounds":{"document_bytes":16777216,"sheet_cells":100000,"run_cost":"one","rows_first":2000,"rows_last":500,"rows_between":2000,"halvings":0,"cell_chars":16384,"cell_head_chars":4096},"cells_cut":0,"cells_raw":0,"read":"whole","date_system":"1900"}

{"sheet":"General Instructions","index":0,"n_rows":10,"n_cols":2,"rows_kept":10,"cut":false,"hidden":false,"merged":[[2,1,5,8],[9,1,11,8]]}
[null,"Purpose:"]
[]
[null,"This tool seeks to support grant implementers that would like to perform a deep-dive review of their financial management systems. By responding to a questionnaire, grant implementers will be able to: \n- assess, analyze and evaluate the root causes of financial management issues/ bottlenecks; and \n- measure and demonstrate improvement in the financial management systems over a period of time."]
[]
[]
[]
[]
[null,"Process:"]
[]
[null,"Financial Management Systems are reviewed using a questionnaire-type approach, targeting 10 key areas. A weighted average score is assigned to each key area which is dependent on average scores obtained for a related set of sub-questions and the relevance (or weight) assigned to that key area of financial management. If the organization is implementing various grants using the same institutional arrangements, information system and staff, one grant review should be performed representing for all grants.\n\nImplementers are required to provide a response by selecting the appropriate score in \"Column F\". The reviewer only needs to compare relevant available information for each question against criteria 4-1 and report appropriate score in \"Column F\". If the available information does not fit into any of the available criteria, the reviewer is required to use professional judgement to score the respective question and provide the rationale in \"Column N\". Furthermore, the reviewer can also use the guidance provided in \"Column M\", which assists in scoring each of the listed questions."]

{"sheet":"Summary","index":1,"n_rows":42,"n_cols":7,"rows_kept":42,"cut":false,"hidden":false,"merged":[[1,0,1,6],[36,0,36,1],[36,5,36,6]]}
[]
["          Financial Management System Diagnostic/Self Review Tool"]
[]
[]
["Financial Management Systems Diagnostic/Self Review"]
["Summary of Outcomes"]
[]
["Financial Management Review Areas","Average Score","Number of review areas","N/A areas","Weight","Weighted Average Score","Remarks/Conclusion"]
[{"$f":"'FMS Diagnostic Review Tool'!B21","v":"1. INSTITUTIONAL AND OVERSIGHT ARRANGEMENT"},{"$f":"'FMS Diagnostic Review Tool'!F32","v":4},{"$f":"'FMS Diagnostic Review Tool'!G32","v":8},{"$f":"'FMS Diagnostic Review Tool'!H32","v":0},{"$f":"(C9-D9)/($C$19-$D$19)","v":0.11594202898550725},{"$f":"IFERROR(B9*E9,\"\")","v":0.46376811594202899}]
[{"$f":"'FMS Diagnostic Review Tool'!B34","v":"2. INTERNAL CONTROLS"},{"$f":"'FMS Diagnostic Review Tool'!F42","v":4},{"$f":"'FMS Diagnostic Review Tool'!G42","v":5},{"$f":"'FMS Diagnostic Review Tool'!H42","v":0},{"$f":"(C10-D10)/($C$19-$D$19)","v":7.2463768115942032E-2},{"$f":"B10*E10","v":0.28985507246376813}]
[{"$f":"'FMS Diagnostic Review Tool'!B44","v":"3. HUMAN RESOURCES"},{"$f":"'FMS Diagnostic Review Tool'!F55","v":4},{"$f":"'FMS Diagnostic Review Tool'!G55","v":8},{"$f":"'FMS Diagnostic Review Tool'!H55","v":0},{"$f":"(C11-D11)/($C$19-$D$19)","v":0.11594202898550725},0.46376811594202899]
[{"$f":"'FMS Diagnostic Review Tool'!B57","v":"4. PLANNING, BUDGETING AND FUNDS FLOW MANAGEMENT"},{"$f":"'FMS Diagnostic Review Tool'!F66","v":4},{"$f":"'FMS Diagnostic Review Tool'!G66","v":6},{"$f":"'FMS Diagnostic Review Tool'!H66","v":0},8.6956521739130432E-2,0.34782608695652173]
[{"$f":"'FMS Diagnostic Review Tool'!B68","v":"5. ACCOUNTING AND RECORD KEEPING"},{"$f":"'FMS Diagnostic Review Tool'!F81","v":4},{"$f":"'FMS Diagnostic Review Tool'!G81","v":10},{"$f":"'FMS Diagnostic Review Tool'!H81","v":0},0.14492753623188406,0.57971014492753625]
[{"$f":"'FMS Diagnostic Review Tool'!B83","v":"6. PROCUREMENT MANAGEMENT"},{"$f":"'FMS Diagnostic Review Tool'!F91","v":4},{"$f":"'FMS Diagnostic Review Tool'!G91","v":5},{"$f":"'FMS Diagnostic Review Tool'!H91","v":0},7.2463768115942032E-2,0.28985507246376813]
[{"$f":"'FMS Diagnostic Review Tool'!B93","v":"7. TREASURY MANAGEMENT"},{"$f":"'FMS Diagnostic Review Tool'!F104","v":4},{"$f":"'FMS Diagnostic Review Tool'!G104","v":8},{"$f":"'FMS Diagnostic Review Tool'!H104","v":0},0.11594202898550725,0.46376811594202899]
[{"$f":"'FMS Diagnostic Review Tool'!B106","v":"8. ASSET AND INVENTORY MANAGEMENT"},{"$f":"'FMS Diagnostic Review Tool'!F112","v":4},{"$f":"'FMS Diagnostic Review Tool'!G112","v":3},{"$f":"'FMS Diagnostic Review Tool'!H112","v":0},4.3478260869565216E-2,0.17391304347826086]
[{"$f":"'FMS Diagnostic Review Tool'!B114","v":"9. FINANCIAL MANAGEMENT OF SUB-RECIPIENTS/SUB-OFFICES"},{"$f":"'FMS Diagnostic Review Tool'!F123","v":4},{"$f":"'FMS Diagnostic Review Tool'!G123","v":6},{"$f":"'FMS Diagnostic Review Tool'!H123","v":0},8.6956521739130432E-2,0.34782608695652173]
[{"$f":"'FMS Diagnostic Review Tool'!B125","v":"10. FINANCIAL REPORTING AND ASSURANCE ARRANGEMENT"},{"$f":"'FMS Diagnostic Review Tool'!F138","v":4},{"$f":"'FMS Diagnostic Review Tool'!G138","v":10},{"$f":"'FMS Diagnostic Review Tool'!H138","v":0},0.14492753623188406,0.57971014492753625]
["Average weighted score",null,{"$f":"SUM(C9:C18)","v":69},{"$f":"SUM(D9:D18)","v":0},{"$f":"SUM(E9:E18)","v":1},{"$f":"SUM(F9:F18)","v":4}]
[]
["Financial Management Components","Average Score","Number of review areas","N/A areas","Weight","Weighted Average Score","Remarks/Conclusion"]
["People",{"$f":"SUMIF('FMS Diagnostic Review Tool'!$D$24:$D$138,\"=\"&Summary!A22, 'FMS Diagnostic Review Tool'!$F$24:$F$138)/COUNTIFS('FMS Diagnostic Review Tool'!$D$24:$D$138,\"=\"&Summary!A22,'FMS Diagnostic Review Tool'!$F$24:$F$138,\">0\")","v":4},{"$f":"COUNTIF('FMS Diagnostic Review Tool'!D23:D138,\"=\"&Summary!A22)","v":14},{"$f":"COUNTIFS('FMS Diagnostic Review Tool'!$D$23:$D$138,\"=\"&Summary!A22,'FMS Diagnostic Review Tool'!$F$23:$F$138,\"=N/A\")","v":0},{"$f":"(C22-D22)/($C$25-$D$25)","v":0.20289855072463769},{"$f":"B22*E22","v":0.81159420289855078}]
["Process",{"$f":"SUMIF('FMS Diagnostic Review Tool'!$D$24:$D$138,\"=\"&Summary!A23, 'FMS Diagnostic Review Tool'!$F$24:$F$138)/COUNTIFS('FMS Diagnostic Review Tool'!$D$24:$D$138,\"=\"&Summary!A23,'FMS Diagnostic Review Tool'!$F$24:$F$138,\">0\")","v":4},{"$f":"COUNTIF('FMS Diagnostic Review Tool'!D24:D139,\"=\"&Summary!A23)","v":47},{"$f":"COUNTIFS('FMS Diagnostic Review Tool'!$D$23:$D$138,\"=\"&Summary!A23,'FMS Diagnostic Review Tool'!$F$23:$F$138,\"=N/A\")","v":0},{"$f":"(C23-D23)/($C$25-$D$25)","v":0.6811594202898551},{"$f":"B23*E23","v":2.7246376811594204}]
["System",{"$f":"SUMIF('FMS Diagnostic Review Tool'!$D$24:$D$138,\"=\"&Summary!A24, 'FMS Diagnostic Review Tool'!$F$24:$F$138)/COUNTIFS('FMS Diagnostic Review Tool'!$D$24:$D$138,\"=\"&Summary!A24,'FMS Diagnostic Review Tool'!$F$24:$F$138,\">0\")","v":4},{"$f":"COUNTIF('FMS Diagnostic Review Tool'!D25:D140,\"=\"&Summary!A24)","v":8},{"$f":"COUNTIFS('FMS Diagnostic Review Tool'!$D$23:$D$138,\"=\"&Summary!A24,'FMS Diagnostic Review Tool'!$F$23:$F$138,\"=N/A\")","v":0},{"$f":"(C24-D24)/($C$25-$D$25)","v":0.11594202898550725},{"$f":"B24*E24","v":0.46376811594202899}]
["Average weighted score",null,{"$f":"SUM(C22:C24)","v":69},{"$f":"SUM(D22:D24)","v":0},{"$f":"SUM(E22:E24)","v":1},{"$f":"SUM(F22:F24)","v":4}]
[]
["Integrated Risk Tool Areas","Average Score","Number of review areas","N/A areas","Weight","Weighted Average Score","Remarks/Conclusion"]
["Flow of Fund Arrangement",{"$f":"SUMIF('FMS Diagnostic Review Tool'!$C$24:$C$138,\"=\"&Summary!A28, 'FMS Diagnostic Review Tool'!$F$24:$F$138)/COUNTIFS('FMS Diagnostic Review Tool'!$C$24:$C$138,\"=\"&Summary!A28,'FMS Diagnostic Review Tool'!$F$24:$F$138,\">0\")","v":4},{"$f":"COUNTIF('FMS Diagnostic Review Tool'!$C$24:$D$138,\"=\"&Summary!A28)","v":4},{"$f":"COUNTIFS('FMS Diagnostic Review Tool'!$C$23:$C$138,\"=\"&Summary!A28,'FMS Diagnostic Review Tool'!$F$23:$F$138,\"=N/A\")","v":0},{"$f":"(C28-D28)/($C$25-$D$25)","v":5.7971014492753624E-2},{"$f":"B28*E28","v":0.2318840579710145}]
["Internal Controls",{"$f":"SUMIF('FMS Diagnostic Review Tool'!$C$24:$C$138,\"=\"&Summary!A29, 'FMS Diagnostic Review Tool'!$F$24:$F$138)/COUNTIFS('FMS Diagnostic Review Tool'!$C$24:$C$138,\"=\"&Summary!A29,'FMS Diagnostic Review Tool'!$F$24:$F$138,\">0\")","v":4},{"$f":"COUNTIF('FMS Diagnostic Review Tool'!$C$24:$D$138,\"=\"&Summary!A29)","v":29},{"$f":"COUNTIFS('FMS Diagnostic Review Tool'!$C$23:$C$138,\"=\"&Summary!A29,'FMS Diagnostic Review Tool'!$F$23:$F$138,\"=N/A\")","v":0},0.42028985507246375,1.681159420289855]
["Corruption and Theft",{"$f":"SUMIF('FMS Diagnostic Review Tool'!$C$24:$C$138,\"=\"&Summary!A30, 'FMS Diagnostic Review Tool'!$F$24:$F$138)/COUNTIFS('FMS Diagnostic Review Tool'!$C$24:$C$138,\"=\"&Summary!A30,'FMS Diagnostic Review Tool'!$F$24:$F$138,\">0\")","v":4},{"$f":"COUNTIF('FMS Diagnostic Review Tool'!$C$24:$D$138,\"=\"&Summary!A30)","v":1},{"$f":"COUNTIFS('FMS Diagnostic Review Tool'!$C$23:$C$138,\"=\"&Summary!A30,'FMS Diagnostic Review Tool'!$F$23:$F$138,\"=N/A\")","v":0},1.4492753623188406E-2,5.7971014492753624E-2]
{"$rows_left_out":13}
{"sheet":"FMS Diagnostic Review Tool","index":2,"n_rows":138,"n_cols":14,"rows_kept":138,"cut":false,"hidden":false,"merged":[[13,4,13,5],[93,8,93,11],[114,5,115,5],[127,12,129,12],[12,1,12,3],[13,1,13,3],[17,1,17,3],[14,1,14,3],[14,4,14,5],[16,1,16,3],[125,1,126,1],[125,3,126,3],[125,4,126,4],[125,5,126,5],[125,8,125,11],[125,12,126,12],[114,1,115,1],[114,3,115,3],[114,4,115,4],[125,2,126,2],[34,2,35,2],[44,2,45,2],[57,2,58,2],[68,2,69,2],[83,2,84,2],[16,4,16,5],[93,4,94,4],[70,12,72,12],[76,12,78,12],[83,1,84,1],[83,3,84,3],[83,4,84,4],[83,5,84,5],[83,8,83,11],[83,12,84,12],[57,1,58,1],[57,3,58,3],[57,4,58,4],[57,5,58,5],[57,8,57,11],[59,12,61,12],[68,1,69,1],[68,3,69,3],[68,4,69,4],[68,5,69,5],[68,8,68,11],[68,12,69,12],[114,8,114,11],[114,12,115,12],[106,12,107,12],[87,12,88,12],[93,1,94,1],[93,3,94,3],[114,2,115,2],[93,12,94,12],[106,1,107,1],[106,3,107,3],[106,4,107,4],[106,5,107,5],[106,8,106,11],[93,2,94,2],[106,2,107,2],[93,5,94,5],[8,4,8,5],[9,4,9,5],[1,1,1,12],[4,4,4,5],[5,4,5,5],[7,4,7,5],[3,1,3,13],[34,12,35,12],[17,4,17,5],[21,1,22,1],[21,3,22,3],[21,4,22,4],[21,5,22,5],[21,8,21,11],[21,12,22,12],[34,1,35,1],[34,3,35,3],[34,4,35,4],[34,5,35,5],[34,8,34,11],[21,2,22,2],[6,4,6,5],[15,4,15,5],[12,4,12,5],[11,1,11,13],[19,1,19,13],[93,13,94,13],[106,13,107,13],[114,13,115,13],[125,13,126,13],[127,13,129,13],[68,13,69,13],[70,13,72,13],[76,13,78,13],[83,13,84,13],[87,13,88,13],[21,13,22,13],[34,13,35,13],[44,13,45,13],[57,13,58,13],[59,13,61,13],[57,12,58,12],[44,1,45,1],[44,3,45,3],[44,4,45,4],[44,5,45,5],[44,8,44,11],[44,12,45,12]]}
[]
[null,"Financial Management System Diagnostic/Self Review Tool"]
[]
[null,"The Global Fund Grant Information (Country and PR)"]
[null,"Country:",{"$nulls":9},"Date of Review:","DD/MM/YYYY"]
[null,"Implementer (Legal) Name:",{"$nulls":9},"Reviewer's Name:","First Name Surname"]
[null,"Type of Implementer:"]
[null,"Number of grants:",{"$nulls":9},"Approver's Name:","First Name Surname"]
[null,"Grant Signed Amount or Budget (US$ or EUR):"]
[null,"Latest implementation period end date:"]
[]
[null,"Contextual Information- Principal Recipient"]
[null,"When did your organization start working with the Global Fund?"]
[null,"How many sub-recipients are involved in grant implementation?"]
[null,"% total budget the sub-recipients are responsible for implementation?"]
[null,"How many SSR(s) is/are involved in grant implementation?"]
[null,"% total budget the SSR(s) is/are responsible for implementation?"]
[null,"Is the PR also SR for other grants?"]
[]
[null,"Questionnaires"]
[null,"1. INSTITUTIONAL AND OVERSIGHT ARRANGEMENT"]
[null,"Key Questions","Corresponding IRT Areas","Type","Status","SCORE \n(4-1)",null,null,"Score",null,null,null,"Guidance","Comments"]
[{"$nulls":8},"4 ↔ Meet Expectation","3 ↔ Low Risk","2 ↔ Medium Risk","1 ↔ High Risk"]
[1,"1.1 Is the  implementer legally registered in the country and is allowed to receive funds from international organizations or donors? ","Internal Controls","Process","Yes",4,null,null,"The implementer is legally registered in the country and is allowed to receive funds from international organizations and donor.","The implementer is legally registered in the country, however, its registration is currently being reviewed due to minor disciplinary/non compliance reasons.","The implementer is legally registered in the country, however, its registration is currently being reviewed due to major disciplinary/non compliance reasons.","The implementer is neither legally registered in the country nor allowed to receive funds from international organizations and donors. ","Obtain and review the registration certificate issued by relevant authority  (including parliament where applicable) and assess its current validity status."]
[{"$f":"A24+1","v":2},"1.2 Is tax status defined and any related exemption status duly formalized in accordance with applicable laws and donor requirements (e.g. is the entity tax exempt or not, etc.)?","Internal Controls","Process","Yes",4,null,null,"The tax status of implementer is  clearly defined and any related exemption status is duly formalized (requested and obtained)  in accordance with applicable laws and donor requirements.","The tax status of implementer is clearly defined and any related exemption status is duly formalized in accordance with applicable laws, however, it does not capture donor requirements","The tax status of implementer is defined, however, any related  exemption status is not formalized (requested but not obtained yet) in accordance with applicable laws and donor requirements","The tax status of implementer is not defined at all.","Obtain and review the tax exemption certificate issued by relevant authority and assess it current validity status."]
[{"$f":"A25+1","v":3},"1.3  Have the adequate segregation of roles and responsibilities been introduced within the governance (governing body) and operating structures (management) to ensure a mechanism for regular checks and balances?","Internal Controls","Process","Yes",4,null,null,"There is a formal governing body (Board of Directors or Trustees) with  defined roles and responsibilities to ensure a mechanism for regular checks and balances. Furthermore, the following conditions are met:\na) The members of governance bodies (including audit committee or equivalent) have the appropriate qualifications;\nb) Governing bodies frequently meet to fulfil their responsibilities; and\nc) Formal conflicts of interest policy is in place and implemented.","There is a formal governing body with  defined roles and responsibilities to ensure a mechanism for regular checks and balances. However, either one of the following is missing:\na) The members of governance bodies have the appropriate qualifications;\nb) Governing bodies frequently meet to fulfil their responsibilities; and\nc) Formal conflicts of interest policy is in place and implemented.","There is a formal governing body, however, the roles and responsibilities of governing body and management are not clearly defined and segregated. ","There is no formal governance structure in place.","Obtain and review the List of governing bodies (e.g. board of director/trustee or parliamentary committee) for governance and oversight of the organization along with:\n- Sample minutes of meeting\n- Frequency of meetings held \n- Reports submitted \n- Terms of reference"]
[4,"1.4 Are the operations planned in a manner that ensure value for money and optimal utilization of the entity’s resources in full compliance with applicable laws, regulation, and procedures?","Internal Controls","People","Yes",4,null,null,"The operations are appropriately planned that ensure value for money and optimal utilization of the entity’s resources in full compliance with applicable laws, regulation, and procedures. This includes:\na) Formal organization structure (organization chart duly approved by competent authority) including specialized functions (i.e. Finance, Procurement, Human Resource etc.); and \nb) Appropriate structure (hierarchy of authority of organization’s functions) and adequate staff (no vacant position).","There is a formal organization structure including specialized functions and have in place adequate staff to achieve functional goals and objectives, however, the structure is not appropriate.","There is an informal (not approved by competent authority) organization structure including informal specialized functions. However, organization structure is not appropriate and the staff are not adequate to achieve overall organizational and functional goals and objectives.","There is no organizational structure at all.","Obtain and review the organogram and evaluate it appropriateness considering the organizational context and industry best practices. "]
[5,"1.5 Are the functional level roles and responsibilities defined, documented and communicated to personnel to ensure a mechanism for proper accountability at all level (including counterparts)?","Internal Controls","Process","Yes",4,null,null,"The functional level roles, responsibilities and accountability  are defined and documented (Article of Association) and communicated to relevant staff to ensure a mechanism for proper accountability at all levels.","The functional level roles and responsibilities are defined, documented and communicated to the relevant personnel, however, these can not ensure a mechanism for proper accountability at all level (some deficiencies are observed).","The functional level roles and responsibilities are defined and documented. However, these:\na) are not communicated to the relevant personnel; and\nb) can not ensure a mechanism for proper accountability at all level.","The functional level roles and responsibilities are not defined at all.","Obtain and review functional role and responsibilities and evaluate it appropriateness considering the organizational context and industry best practices. "]
[6,"1.6 Has the implementer undertaken a robust analysis of the resources (technical, human and other) required to effectively deliver the program goals and objectives related to implementation? ","Value for Money","Process","Yes",4,null,null,"The implementer undertakes a robust analysis of the resources (technical, human and other) required to effectively deliver the program goals and objectives before acceptance of each program/project.","The implementer has undertaken a robust analysis of the resources (technical, human and other) required to effectively deliver the program goals and objectives related to implementation within last 5 years. ","The implementer has undertaken a robust analysis of the resources (technical, human and other) required to effectively deliver the program goals and objectives related to implementation within last 10 years. ","The implementer has not undertaken at all a robust analysis of the resources (technical, human and other) required to effectively deliver the program goals and objectives related to implementation.","Obtain and review assessment and analysis reports. "]
[7,"1.7 Does management understand its responsibility for prevention and detection of fraud and corruption? ","Internal Controls","People","Yes",4,null,null,"Management understands it's responsibilities for prevention and detection of fraud, corruption and non-compliance, and demonstrate the responsibilities including but not limited to:\ni) Setting a tone at the top by demonstrating integrity, objectivity, accountability, openness, honesty and leadership;\nii) Periodically performing a risk assessment with relevant staff to identify the areas of greater intrinsic risk of fraud or corruption;\niii) Monitoring legal requirements and any changes therein and ensuring that operating procedures are designed to meet these requirements.\niv) Instituting and operating appropriate internal control including anti-fraud and corruption policy.\nv) Developing, publishing and applying a Code of Conduct.\nvi) Ensuring employees are properly trained and understand the Code of Conduct. Further, a member of senior management is made responsible for managing financial fraud risk (risk officer).\nvii) Monitoring compliance with the Code of Conduct and acting appropriately to discipline employees who fail to comply with it.\nviii) Engaging legal advisers to assist in monitoring legal requirements and the Code of Conduct.\nix)  Maintaining a register of significant laws and regulations with which the organization has to comply within its particular sector and a record of complaints.","Management understands its responsibilities for prevention and detection of fraud, corruption and non-compliance, however, demonstrated responsibilities do not include one or more of the responsibilities outlined against score 4 of this question. ","Management does not demonstrate most of the requirements outlined against score 4.","Management does not understand its responsibility for prevention and detection of fraud and corruption. ","Discuss with key management and document the management understanding of it's responsibilities for prevention and detection of fraud, corruption and non-compliance."]
{"$rows_left_out":108}