{"text_format":"2","workbook":"xlsx","n_sheets":3,"sheets":["Instructions","Note moyenne pondérée","Outil d'évaluation du FMS"],"not_rendered":{"charts":0,"images":2,"macros":0,"external_links":4,"defined_names":16,"comments":1,"pivot_tables":0},"unopened":[],"bounds":{"document_bytes":16777216,"sheet_cells":100000,"run_cost":"one","rows_first":2000,"rows_last":500,"rows_between":2000,"halvings":0,"cell_chars":16384,"cell_head_chars":4096},"cells_cut":0,"cells_raw":0,"read":"whole","date_system":"1900"}

{"sheet":"Instructions","index":0,"n_rows":10,"n_cols":2,"rows_kept":10,"cut":false,"hidden":false,"merged":[[2,1,5,8],[9,1,11,8]]}
[null,"Objectif :"]
[]
[null,"Cet outil vise à aider les maîtres d’œuvre de la subvention qui souhaiteraient effectuer un examen approfondi de leurs systèmes de gestion financière. En répondant à un questionnaire, les maîtres d’œuvre de la subvention seront en mesure de : \n- déterminer, analyser et évaluer les causes profondes des problèmes de gestion financière et des goulots d'étranglement ; et \n- mesurer et démontrer l'amélioration des systèmes de gestion financière sur une période donnée."]
[]
[]
[]
[]
[null,"Processus :"]
[]
[null,"Les systèmes de gestion financière sont examinés au moyen d’un questionnaire, ciblant dix domaines clés. Une note moyenne pondérée est attribuée à chaque domaine clé. Celle-ci dépend des notes moyennes obtenues pour un ensemble de sous-questions et de la pertinence (ou du poids) attribués à ce domaine clé de la gestion financière. Si l'entité met en œuvre plusieurs subventions en ayant recours aux mêmes arrangements institutionnels, au même système d'information et au même personnel, l’examen d'une des subventions devrait être effectué pour représenter toutes les subventions.\n\nIl incombe aux maîtres d’œuvre de fournir une réponse en sélectionnant la note adéquate dans la « colonne F ». L'examinateur n'a qu'à comparer les renseignements pertinents disponibles pour chaque question avec les critères allant de 1 à 4 et sélectionner la note adéquate dans la « colonne F ». Si les renseignements disponibles ne correspondent à aucun des critères proposés, l'examinateur est tenu d’attribuer la note adéquate selon son appréciation professionnelle et d’indiquer la justification dans la « colonne N ». Par ailleurs, l'examinateur peut également avoir recours aux orientations fournies dans la « colonne M », qui aident à la notation de chacune des questions énumérées."]

{"sheet":"Note moyenne pondérée","index":1,"n_rows":42,"n_cols":7,"rows_kept":42,"cut":false,"hidden":false,"merged":[[1,0,1,6]]}
[]
["          Outil d’évaluation du système de gestion financière"]
[]
[]
["Évaluation du système de gestion financière"]
["Résumé des conclusions"]
[]
["Domaines d’évaluation de la gestion financière","Note moyenne","Number of review areas","N/A areas","Weight","Score moyen pondéré","Remarques/Conclusions"]
[{"$f":"'Outil d''évaluation du FMS'!B21","v":"1. DISPOSITIF INSTITUTIONNEL ET DE SUIVI"},{"$f":"'Outil d''évaluation du FMS'!F32","v":4},{"$f":"'Outil d''évaluation du FMS'!G32","v":8},{"$f":"'Outil d''évaluation du FMS'!H32","v":0},{"$f":"(C9-D9)/($C$19-$D$19)","v":0.11594202898550725},{"$f":"IFERROR(B9*E9,\"\")","v":0.46376811594202899}]
[{"$f":"'Outil d''évaluation du FMS'!B34","v":"2. CONTRÔLES INTERNES"},{"$f":"'Outil d''évaluation du FMS'!F42","v":4},{"$f":"'Outil d''évaluation du FMS'!G42","v":5},{"$f":"'Outil d''évaluation du FMS'!H42","v":0},{"$f":"(C10-D10)/($C$19-$D$19)","v":7.2463768115942032E-2},{"$f":"B10*E10","v":0.28985507246376813}]
[{"$f":"'Outil d''évaluation du FMS'!B44","v":"3. RESSOURCES HUMAINES"},{"$f":"'Outil d''évaluation du FMS'!F55","v":4},{"$f":"'Outil d''évaluation du FMS'!G55","v":8},{"$f":"'Outil d''évaluation du FMS'!H55","v":0},{"$f":"(C11-D11)/($C$19-$D$19)","v":0.11594202898550725},0.46376811594202899]
[{"$f":"'Outil d''évaluation du FMS'!B57","v":"4. PLANIFICATION, BUDGÉTISATION ET GESTION DE LA CIRCULATION DES CAPITAUX"},{"$f":"'Outil d''évaluation du FMS'!F66","v":4},{"$f":"'Outil d''évaluation du FMS'!G66","v":6},{"$f":"'Outil d''évaluation du FMS'!H66","v":0},8.6956521739130432E-2,0.34782608695652173]
[{"$f":"'Outil d''évaluation du FMS'!B68","v":"5. COMPTABILITÉ ET TENUE DES DOSSIERS"},{"$f":"'Outil d''évaluation du FMS'!F81","v":4},{"$f":"'Outil d''évaluation du FMS'!G81","v":10},{"$f":"'Outil d''évaluation du FMS'!H81","v":0},0.14492753623188406,0.57971014492753625]
[{"$f":"'Outil d''évaluation du FMS'!B83","v":"6. GESTION DES ACHATS"},{"$f":"'Outil d''évaluation du FMS'!F91","v":4},{"$f":"'Outil d''évaluation du FMS'!G91","v":5},{"$f":"'Outil d''évaluation du FMS'!H91","v":0},7.2463768115942032E-2,0.28985507246376813]
[{"$f":"'Outil d''évaluation du FMS'!B93","v":"7. GESTION DE LA TRÉSORERIE"},{"$f":"'Outil d''évaluation du FMS'!F104","v":4},{"$f":"'Outil d''évaluation du FMS'!G104","v":8},{"$f":"'Outil d''évaluation du FMS'!H104","v":0},0.11594202898550725,0.46376811594202899]
[{"$f":"'Outil d''évaluation du FMS'!B106","v":"8. GESTION DES ACTIFS"},{"$f":"'Outil d''évaluation du FMS'!F112","v":4},{"$f":"'Outil d''évaluation du FMS'!G112","v":3},{"$f":"'Outil d''évaluation du FMS'!H112","v":0},4.3478260869565216E-2,0.17391304347826086]
[{"$f":"'Outil d''évaluation du FMS'!B114","v":"9. GESTION FINANCIÈRE DES SOUS-BUREAUX OU DES SOUS-RÉCIPIENDAIRES"},{"$f":"'Outil d''évaluation du FMS'!F123","v":4},{"$f":"'Outil d''évaluation du FMS'!G123","v":6},{"$f":"'Outil d''évaluation du FMS'!H123","v":0},8.6956521739130432E-2,0.34782608695652173]
[{"$f":"'Outil d''évaluation du FMS'!B125","v":"10. COMMUNICATION DE L’INFORMATION FINANCIÈRE ET MÉCANISME DE GARANTIE"},{"$f":"'Outil d''évaluation du FMS'!F138","v":4},{"$f":"'Outil d''évaluation du FMS'!G138","v":10},{"$f":"'Outil d''évaluation du FMS'!H138","v":0},0.14492753623188406,0.57971014492753625]
["Note moyenne pondérée",null,{"$f":"SUM(C9:C18)","v":69},{"$f":"SUM(D9:D18)","v":0},{"$f":"SUM(E9:E18)","v":1},{"$f":"SUM(F9:F18)","v":4}]
[]
["Composantes de la gestion financière","Note moyenne","Number of review areas","N/A areas","Weight","Score moyen pondéré","Remarques/Conclusions"]
["Ressources humaines",{"$f":"SUMIF('Outil d''évaluation du FMS'!$D$24:$D$138,\"=\"&'Note moyenne pondérée'!A22, 'Outil d''évaluation du FMS'!$F$24:$F$138)/COUNTIFS('Outil d''évaluation du FMS'!$D$24:$D$138,\"=\"&'Note moyenne pondérée'!A22,'Outil d''évaluation du FMS'!$F$24:$F$138,\">0\")","v":4},{"$f":"COUNTIF('Outil d''évaluation du FMS'!D23:D138,\"=\"&'Note moyenne pondérée'!A22)","v":14},{"$f":"COUNTIFS('Outil d''évaluation du FMS'!$D$23:$D$138,\"=\"&'Note moyenne pondérée'!A22,'Outil d''évaluation du FMS'!$F$23:$F$138,\"=N/A\")","v":0},{"$f":"(C22-D22)/($C$25-$D$25)","v":0.20289855072463769},{"$f":"B22*E22","v":0.81159420289855078}]
["Processus",{"$f":"SUMIF('Outil d''évaluation du FMS'!$D$24:$D$138,\"=\"&'Note moyenne pondérée'!A23, 'Outil d''évaluation du FMS'!$F$24:$F$138)/COUNTIFS('Outil d''évaluation du FMS'!$D$24:$D$138,\"=\"&'Note moyenne pondérée'!A23,'Outil d''évaluation du FMS'!$F$24:$F$138,\">0\")","v":4},{"$f":"COUNTIF('Outil d''évaluation du FMS'!D24:D139,\"=\"&'Note moyenne pondérée'!A23)","v":47},{"$f":"COUNTIFS('Outil d''évaluation du FMS'!$D$23:$D$138,\"=\"&'Note moyenne pondérée'!A23,'Outil d''évaluation du FMS'!$F$23:$F$138,\"=N/A\")","v":0},{"$f":"(C23-D23)/($C$25-$D$25)","v":0.6811594202898551},{"$f":"B23*E23","v":2.7246376811594204}]
["Système",{"$f":"SUMIF('Outil d''évaluation du FMS'!$D$24:$D$138,\"=\"&'Note moyenne pondérée'!A24, 'Outil d''évaluation du FMS'!$F$24:$F$138)/COUNTIFS('Outil d''évaluation du FMS'!$D$24:$D$138,\"=\"&'Note moyenne pondérée'!A24,'Outil d''évaluation du FMS'!$F$24:$F$138,\">0\")","v":4},{"$f":"COUNTIF('Outil d''évaluation du FMS'!D25:D140,\"=\"&'Note moyenne pondérée'!A24)","v":8},{"$f":"COUNTIFS('Outil d''évaluation du FMS'!$D$23:$D$138,\"=\"&'Note moyenne pondérée'!A24,'Outil d''évaluation du FMS'!$F$23:$F$138,\"=N/A\")","v":0},{"$f":"(C24-D24)/($C$25-$D$25)","v":0.11594202898550725},{"$f":"B24*E24","v":0.46376811594202899}]
["Note moyenne pondérée",null,{"$f":"SUM(C22:C24)","v":69},{"$f":"SUM(D22:D24)","v":0},{"$f":"SUM(E22:E24)","v":1},{"$f":"SUM(F22:F24)","v":4}]
[]
["Zones intégrées d'outils de risque\n","Note moyenne",null,null,null,"Score moyen pondéré","Remarques/Conclusions"]
["Flux Financiers",{"$f":"SUMIF('Outil d''évaluation du FMS'!$C$24:$C$138,\"=\"&'Note moyenne pondérée'!A28, 'Outil d''évaluation du FMS'!$F$24:$F$138)/COUNTIFS('Outil d''évaluation du FMS'!$C$24:$C$138,\"=\"&'Note moyenne pondérée'!A28,'Outil d''évaluation du FMS'!$F$24:$F$138,\">0\")","v":4},{"$f":"COUNTIF('Outil d''évaluation du FMS'!$C$24:$D$138,\"=\"&'Note moyenne pondérée'!A28)","v":4},{"$f":"COUNTIFS('Outil d''évaluation du FMS'!$C$23:$C$138,\"=\"&'Note moyenne pondérée'!A28,'Outil d''évaluation du FMS'!$F$23:$F$138,\"=N/A\")","v":0},{"$f":"(C28-D28)/($C$34-$D$34)","v":5.7971014492753624E-2},{"$f":"B28*E28","v":0.2318840579710145}]
["Contrôle Interne",{"$f":"SUMIF('Outil d''évaluation du FMS'!$C$24:$C$138,\"=\"&'Note moyenne pondérée'!A29, 'Outil d''évaluation du FMS'!$F$24:$F$138)/COUNTIFS('Outil d''évaluation du FMS'!$C$24:$C$138,\"=\"&'Note moyenne pondérée'!A29,'Outil d''évaluation du FMS'!$F$24:$F$138,\">0\")","v":4},{"$f":"COUNTIF('Outil d''évaluation du FMS'!$C$24:$D$138,\"=\"&'Note moyenne pondérée'!A29)","v":29},{"$f":"COUNTIFS('Outil d''évaluation du FMS'!$C$23:$C$138,\"=\"&'Note moyenne pondérée'!A29,'Outil d''évaluation du FMS'!$F$23:$F$138,\"=N/A\")","v":0},{"$f":"(C29-D29)/($C$25-$D$25)","v":0.42028985507246375},1.681159420289855]
["Corruption et Vol",{"$f":"SUMIF('Outil d''évaluation du FMS'!$C$24:$C$138,\"=\"&'Note moyenne pondérée'!A30, 'Outil d''évaluation du FMS'!$F$24:$F$138)/COUNTIFS('Outil d''évaluation du FMS'!$C$24:$C$138,\"=\"&'Note moyenne pondérée'!A30,'Outil d''évaluation du FMS'!$F$24:$F$138,\">0\")","v":4},{"$f":"COUNTIF('Outil d''évaluation du FMS'!$C$24:$D$138,\"=\"&'Note moyenne pondérée'!A30)","v":1},{"$f":"COUNTIFS('Outil d''évaluation du FMS'!$C$23:$C$138,\"=\"&'Note moyenne pondérée'!A30,'Outil d''évaluation du FMS'!$F$23:$F$138,\"=N/A\")","v":0},1.4492753623188406E-2,5.7971014492753624E-2]
{"$rows_left_out":13}
{"sheet":"Outil d'évaluation du FMS","index":2,"n_rows":138,"n_cols":15,"rows_kept":138,"cut":false,"hidden":false,"merged":[[106,1,107,1],[114,1,115,1],[125,1,126,1],[34,8,34,11],[68,8,68,11],[83,8,83,11],[34,1,35,1],[44,1,45,1],[57,1,58,1],[68,1,69,1],[83,1,84,1],[34,3,35,3],[34,4,35,4],[34,5,35,5],[44,3,45,3],[114,8,114,11],[106,3,107,3],[106,4,107,4],[106,5,107,5],[93,2,94,2],[106,2,107,2],[68,3,69,3],[68,4,69,4],[14,4,14,5],[1,1,1,12],[3,1,3,12],[4,3,4,4],[5,3,5,4],[7,3,7,4],[6,4,6,5],[11,1,11,12],[12,4,12,5],[13,4,13,5],[8,3,8,4],[9,3,9,4],[21,3,22,3],[21,4,22,4],[19,1,19,13],[93,13,94,13],[21,13,22,13],[34,13,35,13],[44,13,45,13],[57,13,58,13],[68,5,69,5],[59,12,61,12],[83,3,84,3],[83,4,84,4],[83,5,84,5],[59,13,61,13],[21,5,22,5],[21,8,21,11],[21,12,22,12],[21,2,22,2],[21,1,22,1],[93,1,94,1],[127,12,129,12],[34,12,35,12],[44,8,44,11],[44,12,45,12],[57,8,57,11],[57,12,58,12],[93,4,94,4],[93,5,94,5],[15,4,15,5],[44,4,45,4],[44,5,45,5],[57,4,58,4],[57,5,58,5],[17,4,17,5],[16,4,16,5],[34,2,35,2],[44,2,45,2],[57,2,58,2],[68,2,69,2],[83,2,84,2],[76,12,78,12],[68,12,69,12],[70,12,72,12],[83,12,84,12],[57,3,58,3],[106,13,107,13],[114,13,115,13],[125,13,126,13],[127,13,129,13],[68,13,69,13],[70,13,72,13],[76,13,78,13],[83,13,84,13],[87,13,88,13],[87,12,88,12],[93,8,93,11],[93,12,94,12],[106,8,106,11],[106,12,107,12],[125,2,126,2],[114,5,115,5],[125,3,126,3],[125,4,126,4],[125,5,126,5],[114,3,115,3],[114,4,115,4],[114,2,115,2],[114,12,115,12],[125,8,125,11],[125,12,126,12],[93,3,94,3]]}
[]
[null,"Outil d’évaluation du système de gestion financière"]
[]
[null,"Informations concernant la subvention du Fonds mondial (pays et RP)"]
[null,"Pays :",{"$nulls":8},"Date de l’évaluation :"]
[null,"Noms des RP : ",{"$nulls":8},"Contact au Fonds mondial pour l’évaluation :"]
[null,"Type d'Entite :"]
[null,"Nombre de subventions : ",{"$nulls":8},"Examiné avec le RP :"]
[null,"Somme allouée : ",{"$nulls":8},"Date de la mission :"]
[null,"Date de fin de la dernière période de mise en œuvre :",{"$nulls":8},"Responsable financier :"]
[]
[null,"Information contextuelle - Récipiendaire principal"]
[null,"Quand avez-vous commencé à travailler avec le Fonds mondial en tant que récipiendaire principal ?"]
[null,"Combien de sous-récipiendaires (SR) participent à la mise en œuvre de la subvention ?"]
[null,"Combien de sous-sous-récipiendaires (SSR) bénéficient de la subvention ?"]
[null,"Avez-vous rencontré des difficultés avec le Fonds mondial ou d’autres donateurs au cours des trois dernières années (malversation, fraude, etc.) ?"]
[null,"Le RP est-il également le SR pour d’autres subventions ?"]
[null,"Combien de subventions gérez-vous en tant que RP ?"]
[]
[null,"Questionnaires"]
[null,"1. DISPOSITIF INSTITUTIONNEL ET DE SUIVI"]
[null,"Questions clés","Zones IRT correspondantes","Type","Statut","SCORE \n(4-1)",null,null,"Note",null,null,null,"Orientations","Commentaires"]
[{"$nulls":8},"4 ↔ Répond aux attentes","3 ↔ Risque faible","2 ↔ Risque moyen","1 ↔ Risque élevé"]
[1,"1.1 Le maître d’œuvre est-il légalement enregistré dans le pays ? Est-il autorisé à recevoir des fonds d’organisations internationales ou de donateurs ? ","Contrôle Interne","Processus","Oui",4,null,null,"Le maître d’œuvre est légalement enregistré dans le pays et est autorisé à recevoir des fonds d’organisations internationales et de donateurs.","Le maître d’œuvre est légalement enregistré dans le pays, mais son enregistrement est en cours d’examen en raison de problèmes disciplinaires/de non-conformité mineurs.","Le maître d’œuvre est légalement enregistré dans le pays, mais son enregistrement est en cours d’examen en raison de problèmes disciplinaires/de non-conformité majeurs.","Le maître d’œuvre n’est pas enregistré légalement dans le pays ou il n’est pas autorisé à recevoir des fonds d’organisations internationales et de donateurs. ","Obtenir et examiner le certificat d’enregistrement délivré par l’autorité compétente (y compris le parlement le cas échéant) et vérifier s’il est en cours de validité."]
[{"$f":"A24+1","v":2},"1.2 Le statut fiscal a-t-il été défini ? Les démarches obligatoires relatives au régime d’exonération fiscale correspondant ont-elles été effectuées conformément aux lois applicables et aux exigences du donateur (p. ex. la taxe sur les entités fait-elle l’objet d’une exonération) ?","Contrôle Interne","Processus","Oui",4,null,null,"Le statut fiscal du maître d’œuvre est clairement défini et les démarches obligatoires relatives au régime d’exonération fiscale correspondant ont été effectuées conformément aux lois applicables et aux exigences du donateur.","Le statut fiscal du maître d’œuvre est défini et les démarches obligatoires relatives au régime d’exonération fiscale correspondant ont été effectuées conformément aux lois applicables. Cependant, le régime d’exonération fiscale ne satisfait pas pleinement aux exigences du donateur.","Le statut fiscal du maître d’œuvre est défini, mais les démarches obligatoires relatives au régime d’exonération fiscale correspondant n’ont pas été effectuées conformément aux lois applicables et aux exigences du donateur.","Le statut fiscal du maître d’œuvre n’est pas défini.","Obtenir et examiner le certificat d’exonération fiscale délivré par l’autorité compétente et vérifier s’il est en cours de validité."]
[{"$f":"A25+1","v":3},"1.3 La séparation adéquate des rôles et des responsabilités a-t-elle été introduite dans les structures opérationnelles et de gouvernance afin de mettre en place un mécanisme permettant un contrôle régulier ?","Contrôle Interne","Processus","Oui",4,null,null,"Un organe officiel de gouvernance, fonctionnant selon le principe de la séparation des rôles et des responsabilités, est en place afin de garantir l’existence d’un mécanisme de contrôle régulier. Par ailleurs, les conditions suivantes sont réunies :\na) les membres du ou des organe(s) de gouvernance possèdent les qualifications appropriées ;\nb) le ou les organe(s) directeur(s) se réunit/se réunissent fréquemment pour remplir ses/leurs fonctions ; et\nc) une politique formelle relative aux conflits d’intérêts est en place et appliquée.","Une structure de gouvernance officielle est en place et reflète une séparation adéquate des rôles et des responsabilités. Cependant, l’un des critères suivants n’est pas satisfait :\na) les membres du ou des organe(s) de gouvernance possèdent les qualifications appropriées ;\nb) le ou les organe(s) directeur(s) se réunit/se réunissent fréquemment pour remplir ses/leurs fonctions ; et\nc) une politique formelle relative aux conflits d’intérêts est en place et appliquée.\n","Une structure de gouvernance officielle est en place, mais elle ne reflète pas clairement la séparation des rôles et des responsabilités.","Aucune structure de gouvernance officielle n’est en place.","Obtenir et examiner la liste des organes de direction chargés de la gouvernance et de la supervision de l’organisation (p. ex. conseil d’administration ou comité parlementaire), ainsi que les éléments suivants :\n- échantillons des procès-verbaux des réunions ;\n- fréquence des réunions ; \n- rapports soumis ; \n- termes de référence."]
[4,"1.4 Les opérations sont-elles planifiées de manière à garantir un rapport coût/efficacité avantageux et une utilisation optimale des ressources de l’entité, en pleine conformité avec les lois, règlements et procédures applicables ?","Contrôle Interne","Ressources humaines","Oui",4,null,null,"Les opérations sont planifiées de manière appropriée afin de garantir un rapport coût/efficacité avantageux et une utilisation optimale des ressources de l’entité, en pleine conformité avec les lois, règlements et procédures applicables. Cela inclut :\na) une structure organisationnelle officielle (avec notamment un organigramme dûment approuvé par l’autorité compétente) reflétant la spécialisation des fonctions (c.-à-d. finances, achats, ressources humaines, etc.) ; \nb) une structure appropriée (hiérarchie de l’autorité des fonctions de l’organisation) et un personnel adéquat (pas de postes vacants).","Une structure organisationnelle formelle reflétant la spécialisation des fonctions est établie et l’organisation dispose du personnel adéquat pour atteindre les buts et objectifs fonctionnels. Cependant, la structure n’est pas appropriée.","Une structure organisationnelle, reflétant la spécialisation des fonctions, est en place. Cependant ladite structure n’est pas appropriée ou pas approuvée par l’autorité compétente, et l’organisation ne dispose pas du personnel adéquat pour atteindre les buts et objectifs fonctionnels.","Aucune structure organisationnelle n’est en place.","Obtenir et examiner l’organigramme et évaluer s’il est approprié, compte tenu du contexte organisationnel et des bonnes pratiques à l’échelle du secteur. "]
[5,"1.5 Les rôles et les responsabilités au niveau fonctionnel sont-ils définis, documentés et communiqués au personnel afin de garantir qu’un mécanisme de responsabilité adéquat est en place à tous les niveaux (y compris en ce qui concerne les contreparties) ?","Contrôle Interne","Processus","Oui",4,null,null,"La définition des rôles, des responsabilités et de la redevabilité au niveau fonctionnel est établie et documentée (statuts). Elle est communiquée au personnel concerné afin de garantir qu’un mécanisme de responsabilité adéquat est en place à tous les niveaux.","Les rôles et les responsabilités au niveau fonctionnel sont définis, documentés et communiqués au personnel concerné. Cependant, cela ne suffit pas à garantir qu’un mécanisme de responsabilité adéquat est en place à tous les niveaux (des lacunes sont relevées).","Les rôles et les responsabilités au niveau fonctionnel sont définis et documentés. Cependant :\na) ils n’ont pas été communiqués au personnel concerné ; et\nb) cela ne suffit pas à garantir qu’un mécanisme de responsabilité adéquat est en place à tous les niveaux.","Les rôles et les responsabilités au niveau fonctionnel ne sont pas définis.","Obtenir et examiner la matrice des rôles et des responsabilités au niveau fonctionnel et évaluer si elle est appropriée, compte tenu du contexte organisationnel et des bonnes pratiques à l’échelle du secteur. "]
[6,"1.6 Le maître d’œuvre a-t-il réalisé une analyse solide des ressources (techniques, humaines et autres) nécessaires pour atteindre les buts et les objectifs du programme liés à la mise en œuvre ? ","Rapport Qualite/Prix (Value for money)","Processus","Oui",4,null,null,"Le maître d’œuvre réalise une analyse solide des ressources (techniques, humaines et autres) nécessaires pour atteindre les buts et les objectifs du programme avant d’approuver un programme/projet.","Le maître d’œuvre a réalisé une analyse solide des ressources (techniques, humaines et autres) nécessaires pour atteindre les buts et les objectifs du programme liés à la mise en œuvre au cours des cinq dernières années. ","Le maître d’œuvre a réalisé une analyse solide des ressources (techniques, humaines et autres) nécessaires pour atteindre les buts et les objectifs du programme liés à la mise en œuvre au cours des dix dernières années. ","Le maître d’œuvre n’a jamais réalisé d’analyse solide des ressources (techniques, humaines et autres) nécessaires pour atteindre les buts et les objectifs du programme liés à la mise en œuvre. ","Obtenir et examiner les rapports d’évaluation et d’analyse. "]
[7,"1.7 La direction est-elle consciente de sa responsabilité en matière de prévention et de détection de la fraude et de la corruption ? ","Contrôle Interne","Ressources humaines","Oui",4,null,null,"La direction comprend sa responsabilité en matière de prévention et de détection de la fraude, de la corruption et des problèmes de non-conformité. À ce titre, elle assume les responsabilités suivantes, entre autres :\ni) montrer l’exemple en faisant preuve d’intégrité, d’objectivité, de redevabilité, d’ouverture, d’honnêteté et de leadership ;\nii) réaliser périodiquement une évaluation des risques auprès des employés concernés afin de déterminer les domaines qui présentent le risque intrinsèque le plus élevé de fraude ou de corruption ;\niii) contrôler régulièrement le respect des obligations légales, ainsi que les évolutions de ces dernières, et veiller à ce que les procédures opérationnelles soient conçues de manière à satisfaire lesdites obligations ;\niv) établir et appliquer un contrôle interne approprié, notamment par le biais d’une politique de lutte contre la fraude et la corruption ;\nv) élaborer, rendre public et appliquer un code de conduite ;\nvi) veiller à ce que les employés soient correctement formés et qu’ils comprennent le code de conduite. Confier également à un membre de l’équipe dirigeante la responsabilité de gérer les risques de fraude financière (responsable des risques) ;\nvii) contrôler le respect du code de conduite et prendre les mesures disciplinaires appropriées à l’encontre des employés qui ne le respectent pas ;\nviii) solliciter l’aide de conseillers juridiques pour le suivi du respect des obligations légales et du code de conduite ;\nix) tenir à jour un registre des lois et de la réglementation importantes auxquelles l’organisation doit se conformer dans son secteur d’activité, ainsi qu’un registre des plaintes.","La direction comprend sa responsabilité en matière de prévention et de détection de la fraude, de la corruption et des problèmes de non-conformité, mais elle n’assume pas l’une au moins des responsabilités énumérées comme conditions pour obtenir une note de 4. ","La direction n’assume pas la plupart des responsabilités énumérées comme conditions pour obtenir une note de 4.","La direction ne comprend pas sa responsabilité en matière de prévention et de détection de la fraude et de la corruption. ","Discuter avec le personnel clé de la direction et documenter la compréhension par la direction de sa responsabilité en matière de prévention et de détection de la fraude, de la corruption et des problèmes de non-conformité."]
{"$rows_left_out":108}