{"text_format":"2","workbook":"xlsx","n_sheets":8,"sheets":["SETUP and Instructions","C19RM Budget","Annex A - COVID-19 Diagc Tests","Annex B - PPE and other HP","Budget Summary","Free worksheet","ctlgs","PRList"],"not_rendered":{"charts":0,"images":1,"macros":0,"external_links":0,"defined_names":4,"comments":0,"pivot_tables":0},"unopened":[],"bounds":{"document_bytes":16777216,"sheet_cells":100000,"run_cost":"one","rows_first":2000,"rows_last":500,"rows_between":2000,"halvings":0,"cell_chars":16384,"cell_head_chars":4096},"cells_cut":0,"cells_raw":0,"read":"whole","date_system":"1900"}

{"sheet":"SETUP and Instructions","index":0,"n_rows":124,"n_cols":54,"rows_kept":124,"cut":false,"hidden":false,"merged":[[19,1,19,6],[13,1,18,6],[20,1,20,6],[1,1,1,6],[50,53,50,54],[8,5,8,6],[25,3,25,6],[26,3,26,6]]}
[{"$nulls":6},"Date Published: 10 June 2020 (rev 15 July)",{"$nulls":5},"Update 03 July"]
[null,"C19RM Funding Request Supplementary Template ",{"$nulls":10},"Control field 1",{"$nulls":12},"Please Select"]
[{"$nulls":12},{"$f":"SUM(M7:M11)","v":0},{"$nulls":12},"Please Select"]
[null,"Country",null,null,null,"Grant Currency:","Please Select"]
[{"$nulls":5},"Local currency","Please Select"]
[null,"Rceipient/Implementer name","Grant number",null,null,{"$f":"IF(G4=\"Please Select\", \"Fx rate to grant currency\", \"Exchange rate to \" &G4 &\" (1 \"&G4 &\"= )\")","v":"Fx rate to grant currency"},1,{"$f":"IF(G5=\"Please select\",\"\",G5)","v":""}]
[1,null,{"$f":"IF(ISBLANK(B7)=TRUE,\"\",VLOOKUP(B7,PRList!B:E,2,FALSE))","v":""},{"$nulls":9},{"$f":"IF(N7=\"n/A\",0,1)","v":0},{"$f":"IF(ISBLANK(B7)=TRUE,\"N/A\",VLOOKUP(B7,PRList!B:E,2,FALSE))","v":"N/A"}]
[2,null,{"$f":"IF(ISBLANK(B8)=TRUE,\"\",VLOOKUP(B8,PRList!B:E,2,FALSE))","v":""},null,null,"definition of cell highlights",{"$nulls":6},{"$f":"IF(N8=\"n/A\",0,1)","v":0},{"$f":"IF(ISBLANK(B8)=TRUE,\"N/A\",VLOOKUP(B8,PRList!B:E,2,FALSE))","v":"N/A"}]
[3,null,{"$f":"IF(ISBLANK(B9)=TRUE,\"\",VLOOKUP(B9,PRList!B:E,2,FALSE))","v":""},null,null,"Locked cells, no data entry is required"]
[4,null,{"$f":"IF(ISBLANK(B10)=TRUE,\"\",VLOOKUP(B10,PRList!B:E,2,FALSE))","v":""},null,null,"Data entry cells: please enter the necessary data"]
{"$rows_left_out":95}
{"sheet":"C19RM Budget","index":1,"n_rows":155,"n_cols":41,"rows_kept":155,"cut":false,"hidden":false,"merged":[[0,0,1,0],[5,7,6,7],[8,1,8,2],[9,1,9,2],[5,0,6,0],[0,4,0,6],[5,6,6,6],[5,4,6,4],[5,5,6,5],[5,1,6,1],[5,2,6,2],[5,3,6,3],[13,1,13,2],[14,1,14,2],[15,1,15,2],[19,1,19,2],[5,23,6,23],[11,1,11,2],[12,1,12,2],[5,14,5,19],[5,20,5,21],[5,22,6,22],[10,1,10,2],[5,8,5,13],[16,1,16,2],[17,1,17,2],[18,1,18,2],[5,24,6,24],[0,15,0,17],[0,18,0,19],[0,20,0,21],[1,18,1,19],[2,18,2,19],[3,18,3,19],[1,20,1,21],[2,20,2,21],[3,20,3,21]]}
["C19RM Funding Request Supplementary Template ","Grant Currency:",{"$f":"IF('SETUP and Instructions'!G4=\"Please select\", \"No grant currency is selected on Setup Tab\",'SETUP and Instructions'!G4)","v":"No grant currency is selected on Setup Tab"},null,"Summary",null,null,"Priority 1","Priority 2",{"$nulls":6},"Summary",null,null,"Priority 1",null,"Priority 2",{"$nulls":14},"Service column"]
[null,"Local Currency",{"$f":"IF('SETUP and Instructions'!G5=\"Please select\", \"No local currency is selected on Setup Tab\",'SETUP and Instructions'!G5)","v":"No local currency is selected on Setup Tab"},null,"Sub Total Health Products",null,null,{"$f":"S2","v":0},{"$f":"U2","v":0},{"$nulls":6},"Sub Total Health Products",null,null,{"$f":"IF(ISNUMBER(SUM(T9:T20))=TRUE,SUM(T9:T20),0)","v":0},null,{"$f":"IF(ISNUMBER(SUM(V9:V20))=TRUE,SUM(V9:V20),0)","v":0},{"$nulls":14},{"$f":"IF(C1=\"Please select\", \"ERROR, no grant currency is selected\",C1)","v":"No grant currency is selected on Setup Tab"}]
[null,{"$f":"'SETUP and Instructions'!F6","v":"Fx rate to grant currency"},{"$f":"'SETUP and Instructions'!G6","v":1},null,"Sub Total activities and non-HP",null,null,{"$f":"S3","v":0},{"$f":"U3","v":0},{"$nulls":6},"Sub Total activities and non-HP",null,null,{"$f":"IF(ISNUMBER(SUM(T23:T154))=TRUE,SUM(T23:T154),0)","v":0},null,{"$f":"IF(ISNUMBER(SUM(V23:V154))=TRUE,SUM(V23:V154),0)","v":0},{"$nulls":14},{"$f":"IF(C2=\"Please select\", \"ERROR, no local currency is selected\",C2)","v":"No local currency is selected on Setup Tab"}]
[{"$nulls":4},"Total ",null,null,{"$f":"S4","v":""},{"$f":"U4","v":""},{"$nulls":6},"Total ",null,null,{"$f":"IF(S2+S3>0,S3+S2,\"\")","v":""},null,{"$f":"IF(U2+U3>0,U3+U2,\"\")","v":""}]
[{"$nulls":35},"Please select"]
["Activity category","Sub-Categery","Activity description","PR/Grant","Unit of measure ","Payment Currency ","Unit Price (Payment currency)",{"$f":"IF('SETUP and Instructions'!G4=\"Please select\",\"Unit Price - grant currency\",\"Unit Price (\"&C1&\")\")","v":"Unit Price - grant currency"},"Quantity for PRIORITY 1",{"$nulls":5},"Budget for activities under the PRIORITY 1",{"$nulls":5},"Priority 2",null,"Reference for Activity / CCM or PR Comment","LFA comment","GF comment"]
[{"$nulls":8},"Quantity \n(Q2-2020)","Quantity \n(Q3-2020)","Quantity \n(Q4-2020)","Quantity \n(Q1-2021)","Quantity \n(Q2-2021)","Total","Q2-2020","Q3-2020","Q4-2020","Q1-2021","Q2-2021",{"$f":"IF('SETUP and Instructions'!G4=\"Please select\",\"Total budget - grant currency\",\"Total Budget Price (\"&C1&\")\")","v":"Total budget - grant currency"},"Quantity","Total grant currency "]
["Health Products"]
["Mitigating impact of Covid-19","Diagnostic Products",null,{"$f":"IF('SETUP and Instructions'!$M$3=1,'SETUP and Instructions'!$C$7,\"\")","v":""},{"$nulls":10},0,{"$f":"'Annex A - COVID-19 Diagc Tests'!AQ142","v":0},{"$f":"'Annex A - COVID-19 Diagc Tests'!AR142","v":0},{"$f":"'Annex A - COVID-19 Diagc Tests'!AS142","v":0},0,{"$f":"SUM(O9:S9)","v":0},null,{"$f":"'Annex A - COVID-19 Diagc Tests'!AW142","v":0}]
["Mitigating impact of Covid-19","PPE & Infection Control (products)",null,{"$f":"IF('SETUP and Instructions'!$M$3=1,'SETUP and Instructions'!$C$7,\"\")","v":""},{"$nulls":10},0,{"$f":"'Annex B - PPE and other HP'!AT139+'Annex B - PPE and other HP'!AX25","v":0},{"$f":"'Annex B - PPE and other HP'!AU139+'Annex B - PPE and other HP'!AY25","v":0},{"$f":"'Annex B - PPE and other HP'!AV139+'Annex B - PPE and other HP'!AZ25","v":0},0,{"$f":"SUM(O10:S10)","v":0},null,{"$f":"'Annex B - PPE and other HP'!BB139+'Annex B - PPE and other HP'!BC25","v":0}]
{"$rows_left_out":146}
{"sheet":"Annex A - COVID-19 Diagc Tests","index":2,"n_rows":148,"n_cols":49,"rows_kept":148,"cut":false,"hidden":false,"merged":[[119,18,119,19],[120,18,120,19],[121,18,121,19],[122,18,122,19],[140,18,140,19],[141,15,141,16],[141,19,141,20],[28,18,28,19],[136,18,136,19],[137,18,137,19],[138,18,138,19],[126,18,126,19],[127,18,127,19],[133,18,133,19],[134,18,134,19],[59,18,59,19],[60,18,60,19],[61,18,61,19],[62,18,62,19],[63,18,63,19],[64,18,64,19],[65,18,65,19],[66,18,66,19],[67,18,67,19],[57,36,57,39],[57,42,57,44],[57,47,57,48],[55,1,55,12],[50,15,50,16],[50,19,50,20],[50,1,50,3],[57,22,58,22],[57,18,58,19],[57,7,57,13],[57,14,58,14],[57,15,58,15],[57,16,58,16],[57,17,58,17],[57,20,57,21],[53,1,53,3],[57,1,58,1],[57,2,58,3],[57,4,58,4],[57,5,58,5],[57,6,58,6],[12,36,12,39],[12,47,12,48],[32,36,32,39],[32,42,32,44],[32,47,32,48],[15,39,20,39],[21,39,22,39],[23,39,24,39],[15,41,20,41],[21,41,22,41],[23,41,24,41],[12,42,12,44],[15,42,20,42],[15,44,20,44],[21,42,22,42],[21,44,22,44],[23,42,24,42],[23,44,24,44],[15,36,20,36],[15,37,20,37],[15,38,20,38],[21,36,22,36],[21,37,22,37],[21,38,22,38],[48,18,48,19],[15,29,20,29],[21,29,22,29],[23,29,24,29],[15,27,20,27],[34,18,34,19],[35,18,35,19],[36,18,36,19],[37,18,37,19],[38,18,38,19],[39,18,39,19],[40,18,40,19],[41,18,41,19],[32,20,32,21],[21,27,22,27],[23,27,24,27],[32,22,33,22],[32,18,33,19],[12,18,13,18],[12,19,12,20],[15,19,20,19],[15,20,20,20],[21,19,22,19],[21,20,22,20],[23,19,24,19],[23,20,24,20],[23,1,24,1],[23,2,24,2],[21,14,22,14],[23,14,24,14],[23,6,24,6],[23,7,24,7],[21,5,22,5],[21,6,22,6],[21,7,22,7],[12,1,13,1],[12,2,13,2],[12,3,13,3],[12,4,13,4],[12,5,13,5],[12,6,13,6],[12,7,13,7],[15,48,20,48],[21,48,22,48],[23,48,24,48],[141,1,141,3],[15,16,20,17],[21,16,22,17],[23,16,24,17],[25,16,25,17],[26,16,26,17],[15,15,20,15],[21,15,22,15],[23,15,24,15],[15,11,20,11],[21,11,22,11],[54,1,54,12],[15,13,20,13],[23,13,24,13],[21,13,22,13],[31,1,31,17],[21,10,22,10],[15,7,20,7],[15,5,20,5],[23,8,24,8],[23,9,24,9],[77,2,77,3],[78,2,78,3],[79,2,79,3],[80,2,80,3],[15,43,20,43],[21,43,22,43],[23,43,24,43],[42,18,42,19],[43,18,43,19],[44,18,44,19],[45,18,45,19],[46,18,46,19],[47,18,47,19],[68,2,68,3],[69,2,69,3],[70,2,70,3],[71,2,71,3],[72,2,72,3],[73,2,73,3],[74,2,74,3],[75,2,75,3],[76,2,76,3],[21,8,22,8],[21,9,22,9],[15,47,20,47],[21,47,22,47],[23,47,24,47],[15,2,20,2],[21,2,22,2],[15,30,20,30],[21,30,22,30],[23,30,24,30],[15,31,20,31],[21,31,22,31],[23,31,24,31],[23,10,24,10],[15,18,20,18],[21,18,22,18],[23,18,24,18],[23,36,24,36],[23,37,24,37],[23,38,24,38],[12,0,13,0],[15,0,20,0],[21,0,22,0],[23,0,24,0],[28,0,28,3],[32,0,33,0],[136,2,136,3],[137,2,137,3],[140,2,140,3],[60,2,60,3],[59,2,59,3],[139,2,139,3],[106,2,106,3],[105,2,105,3],[138,2,138,3],[101,2,101,3],[100,2,100,3],[99,2,99,3],[67,2,67,3],[66,2,66,3],[65,2,65,3],[104,2,104,3],[103,2,103,3],[102,2,102,3],[57,0,58,0],[15,26,20,26],[21,26,22,26],[23,26,24,26],[23,11,24,11],[15,8,20,8],[15,9,20,9],[23,5,24,5],[15,10,20,10],[32,3,33,3],[32,4,33,4],[49,1,49,3],[15,1,20,1],[21,1,22,1],[15,6,20,6],[21,12,22,12],[27,1,27,3],[27,16,27,17],[32,1,33,1],[32,2,33,2],[23,12,24,12],[32,7,32,13],[32,14,33,14],[15,12,20,12],[12,8,12,14],[12,15,13,15],[0,12,0,14],[1,12,1,14],[2,12,2,14],[0,15,0,17],[1,15,1,17],[2,15,2,17],[64,2,64,3],[63,2,63,3],[62,2,62,3],[61,2,61,3],[12,16,13,17],[14,16,14,17],[15,14,20,14],[32,5,33,5],[32,6,33,6],[7,1,7,17],[32,15,33,15],[32,16,33,16],[32,17,33,17],[2,1,4,4],[81,2,81,3],[82,2,82,3],[83,2,83,3],[84,2,84,3],[85,2,85,3],[86,2,86,3],[87,2,87,3],[88,2,88,3],[89,2,89,3],[127,2,127,3],[110,2,110,3],[111,2,111,3],[112,2,112,3],[113,2,113,3],[114,2,114,3],[115,2,115,3],[116,2,116,3],[117,2,117,3],[118,2,118,3],[86,18,86,19],[119,2,119,3],[120,2,120,3],[121,2,121,3],[122,2,122,3],[123,2,123,3],[124,2,124,3],[125,2,125,3],[126,2,126,3],[90,2,90,3],[91,2,91,3],[92,2,92,3],[93,2,93,3],[94,2,94,3],[95,2,95,3],[96,2,96,3],[97,2,97,3],[98,2,98,3],[107,2,107,3],[108,2,108,3],[109,2,109,3],[99,18,99,19],[100,18,100,19],[101,18,101,19],[77,18,77,19],[78,18,78,19],[79,18,79,19],[80,18,80,19],[81,18,81,19],[82,18,82,19],[83,18,83,19],[84,18,84,19],[85,18,85,19],[68,18,68,19],[69,18,69,19],[70,18,70,19],[71,18,71,19],[72,18,72,19],[73,18,73,19],[74,18,74,19],[75,18,75,19],[76,18,76,19],[139,18,139,19],[96,18,96,19],[97,18,97,19],[98,18,98,19],[110,18,110,19],[111,18,111,19],[112,18,112,19],[113,18,113,19],[114,18,114,19],[115,18,115,19],[102,18,102,19],[103,18,103,19],[104,18,104,19],[105,18,105,19],[106,18,106,19],[107,18,107,19],[123,18,123,19],[124,18,124,19],[125,18,125,19],[108,18,108,19],[109,18,109,19],[116,18,116,19],[117,18,117,19],[118,18,118,19],[128,18,128,19],[129,18,129,19],[130,18,130,19],[131,18,131,19],[132,18,132,19],[135,18,135,19],[135,2,135,3],[134,2,134,3],[133,2,133,3],[132,2,132,3],[128,2,128,3],[129,2,129,3],[130,2,130,3],[131,2,131,3],[87,18,87,19],[88,18,88,19],[89,18,89,19],[90,18,90,19],[91,18,91,19],[92,18,92,19],[93,18,93,19],[94,18,94,19],[95,18,95,19]]}
[null,"Annex A: Diagnostic Products",{"$nulls":10},"Grant Currency:",null,null,{"$f":"'C19RM Budget'!C1","v":"No grant currency is selected on Setup Tab"},{"$nulls":13},"Service column","Service column","Service column","Service column","Service column","Service column","Service column"]
[{"$nulls":12},"Local Currency",null,null,{"$f":"'C19RM Budget'!C2","v":"No local currency is selected on Setup Tab"},{"$nulls":13},{"$f":"'C19RM Budget'!C1","v":"No grant currency is selected on Setup Tab"}]
[null,"1. Please fill up the table with required full specifications (e.g. technical specifications) and references (e.g. WHO technical documents), as applicable\n2. Please provide unit price in local currency for items proposed to be locally and paid in local currency, and USD for all proposed international procurements; citing standard (or available) reference prices. \n3. Please enter additional rows if you have more items, but make sure the grand total is adding up correctly. ",{"$nulls":10},{"$f":"'C19RM Budget'!B3","v":"Fx rate to grant currency"},null,null,{"$f":"'C19RM Budget'!C3","v":1},{"$nulls":13},{"$f":"'C19RM Budget'!C2","v":"No local currency is selected on Setup Tab"}]
[]
[]
[]
[null,"PART 1: Covid-19 diagnostic tests (6 types) included in the WHO Diagnostics Consortium allocation model. "]
[null,"Note: (a) Please ensure the requested quantities for the 6 type of tests are within the WHO allocated test numbers for the requesting country, in coordination with the WHO Country Office. (b) The cells in green request for information if available in-country."]
[null,"Unit costs for the six diagnostic tests presented under Part A are pre-populated in line with the prices negotiated by the WHO procurement consortia. Prices are shown in GRANT CURRENCY (EUR or USD) and include estimated cost of delivery to the country"]
[null,"The CCM/PR may change the pre-populated unit cost. However, a justification shall be provided to justify the changes"]
{"$rows_left_out":139}
{"sheet":"Annex B - PPE and other HP","index":3,"n_rows":150,"n_cols":55,"rows_kept":150,"cut":false,"hidden":false,"merged":[[137,0,137,3],[2,11,2,12],[10,0,11,0],[2,1,2,9],[3,1,4,9],[53,0,54,0],[53,1,54,1],[53,2,54,2],[53,7,54,7],[53,6,54,6],[10,1,11,3],[26,0,26,3],[25,0,25,3],[24,0,24,3],[10,4,11,4],[10,5,11,5],[10,6,11,6],[10,7,10,13],[53,13,54,13],[53,5,54,5],[58,3,58,4],[59,3,59,4],[61,3,61,4],[62,3,62,4],[53,14,54,14],[53,15,54,15],[53,16,54,16],[53,17,54,17],[53,18,54,18],[53,19,54,19],[25,13,25,16],[50,1,50,10],[7,1,7,5],[8,1,8,5],[53,3,54,4],[100,3,100,4],[89,3,89,4],[90,3,90,4],[91,3,91,4],[92,3,92,4],[93,3,93,4],[94,3,94,4],[101,3,101,4],[55,3,55,4],[56,3,56,4],[57,3,57,4],[68,3,68,4],[69,3,69,4],[70,3,70,4],[60,3,60,4],[71,3,71,4],[72,3,72,4],[63,3,63,4],[64,3,64,4],[65,3,65,4],[66,3,66,4],[67,3,67,4],[102,3,102,4],[103,3,103,4],[73,3,73,4],[95,3,95,4],[96,3,96,4],[97,3,97,4],[98,3,98,4],[109,3,109,4],[74,3,74,4],[75,3,75,4],[76,3,76,4],[77,3,77,4],[78,3,78,4],[79,3,79,4],[80,3,80,4],[81,3,81,4],[82,3,82,4],[83,3,83,4],[84,3,84,4],[85,3,85,4],[86,3,86,4],[87,3,87,4],[88,3,88,4],[99,3,99,4],[110,3,110,4],[111,3,111,4],[112,3,112,4],[113,3,113,4],[104,3,104,4],[105,3,105,4],[106,3,106,4],[107,3,107,4],[108,3,108,4],[119,3,119,4],[120,3,120,4],[121,3,121,4],[122,3,122,4],[123,3,123,4],[114,3,114,4],[115,3,115,4],[116,3,116,4],[117,3,117,4],[118,3,118,4],[134,3,134,4],[135,3,135,4],[129,3,129,4],[130,3,130,4],[131,3,131,4],[132,3,132,4],[133,3,133,4],[124,3,124,4],[125,3,125,4],[126,3,126,4],[127,3,127,4],[128,3,128,4],[9,53,9,54],[9,45,9,51],[10,45,10,47],[10,49,10,51],[0,11,0,12],[1,11,1,12],[0,13,0,16],[1,13,1,16],[2,13,2,16],[10,22,10,23],[10,20,10,21],[10,19,11,19],[10,18,11,18],[10,14,11,14],[10,15,11,15],[10,16,11,16],[10,17,11,17],[53,42,53,44],[53,53,53,54],[32,49,32,51],[43,0,43,3],[44,0,44,3],[44,13,44,16],[45,0,45,3],[32,41,32,43],[32,18,33,18],[32,19,33,19],[32,20,32,21],[32,45,32,47],[32,7,32,13],[32,14,33,14],[32,15,33,15],[32,16,33,16],[32,17,33,17],[32,0,33,0],[32,1,33,3],[32,4,33,4],[32,5,33,5],[32,6,33,6],[53,21,53,22],[53,20,54,20]]}
[null,"Annex B: Personal Protective Equipment (PPE) and other health products",{"$nulls":9},{"$f":"'C19RM Budget'!B1","v":"Grant Currency:"},null,{"$f":"'C19RM Budget'!C1","v":"No grant currency is selected on Setup Tab"},{"$nulls":26},"Service column","Service column","Service column","Service column","Service column","Service column","Service column","Service column","Service column","Service column","Service column","Service column","Service column","Service column","Service column"]
[{"$nulls":11},{"$f":"'C19RM Budget'!B2","v":"Local Currency"},null,{"$f":"'C19RM Budget'!C2","v":"No local currency is selected on Setup Tab"},{"$nulls":26},{"$f":"'C19RM Budget'!C1","v":"No grant currency is selected on Setup Tab"}]
[null,"Please submit quantification/forecast of health products included in the request (showing assumptions and calculations used for estimation of health products needs)",{"$nulls":9},{"$f":"'C19RM Budget'!B3","v":"Fx rate to grant currency"},null,{"$f":"'C19RM Budget'!C3","v":1},{"$nulls":26},{"$f":"'C19RM Budget'!C2","v":"No local currency is selected on Setup Tab"}]
[null,"The quantification, ideally, should be prepared as per the WHO Covid-19 Essential Supplies Forecasting Tool (COVID-ESFT) v2.0: https://www.who.int/who-documents-detail/covid-19-essential-supplies-forecasting-tool       "]
[]
[]
["Part 1","Infection control / Health worker protection/PPE"]
[null,"By default PPE is budgeted under the \" Actions to reinforce the response to COVID-19\" category. However,  PPE can also be included under the \"interventions to mitigate the impact of COVID-19 on HIV, TB and malaria disease programs\" category. The split of PPE between the two categories can be specified under columns \"W\" and \"X\""]
[null,"PSM costs: Please indicate an estimated cost of delivery of products from a manufacturer to the country (first port of entry) as a percentage of the value of the goods (in the cell P:25)"]
[{"$nulls":45},"Budget P1",{"$nulls":7},"Budget P2"]
{"$rows_left_out":141}
{"sheet":"Budget Summary","index":4,"n_rows":40,"n_cols":28,"rows_kept":40,"cut":false,"hidden":false,"merged":[[33,2,34,2],[24,10,25,10],[33,0,34,0],[33,1,34,1],[33,3,33,8],[33,9,34,9],[33,10,34,10],[4,0,5,0],[24,0,25,0],[24,1,25,1],[24,3,24,8],[24,9,25,9],[24,2,25,2],[4,11,5,11],[4,3,4,8],[4,9,5,9],[4,10,5,10],[4,1,5,1],[4,2,5,2]]}
[null,null,"C19RM FUNDING REQUEST: Summary Budget",{"$nulls":18},"Control column","Control column","Control column","Control column","Control column","Control column","Control column"]
[{"$nulls":22},"Q2-2020","Q3-2020","Q4-2020","Q1-2021","Q2-2021","Total P2"]
[{"$nulls":21},"Total",{"$f":"SUM('C19RM Budget'!O9:O154)","v":0},{"$f":"SUM('C19RM Budget'!P9:P154)","v":0},{"$f":"SUM('C19RM Budget'!Q9:Q154)","v":0},{"$f":"SUM('C19RM Budget'!R9:R154)","v":0},{"$f":"SUM('C19RM Budget'!S9:S154)","v":0},{"$f":"SUM('C19RM Budget'!V9:V154)","v":0}]
[null,null,"Summary budget By Activity category in Grant Currency"]
["sn","By Activity category","By Activity category","Priority 1",{"$nulls":5},"Priority 2","Total request (P1 +P2)"]
[null,null,null,"Q2-2020","Q3-2020","Q4-2020","Q-2021","Q2-2021","Total",{"$nulls":13},"currency",{"$f":"'SETUP and Instructions'!G4","v":"Please Select"}]
[1,{"$f":"'C19RM Budget'!A9","v":"Mitigating impact of Covid-19"},"Mitigating impact of Covid-19",{"$f":"SUMIF('C19RM Budget'!A9:A154,'Budget Summary'!B7,'C19RM Budget'!O9:O154)","v":0},{"$f":"SUMIF('C19RM Budget'!A9:A154,'Budget Summary'!B7,'C19RM Budget'!P9:P154)","v":0},{"$f":"SUMIF('C19RM Budget'!A9:A154,'Budget Summary'!B7,'C19RM Budget'!Q9:Q154)","v":0},{"$f":"SUMIF('C19RM Budget'!A9:A154,'Budget Summary'!B7,'C19RM Budget'!R9:R154)","v":0},{"$f":"SUMIF('C19RM Budget'!A9:A154,'Budget Summary'!B7,'C19RM Budget'!S9:S154)","v":0},{"$f":"SUM(D7:H7)","v":0},{"$f":"SUMIF('C19RM Budget'!A9:A154,'Budget Summary'!B7,'C19RM Budget'!V9:V154)","v":0},{"$f":"I7+J7","v":0},{"$nulls":11},"rate",0.90664999999999996]
[2,{"$f":"'C19RM Budget'!A13","v":"Reinforcing national response"},"Reinforcing national response to COVID19",{"$f":"SUMIF('C19RM Budget'!A9:A154,'Budget Summary'!B8,'C19RM Budget'!O9:O154)","v":0},{"$f":"SUMIF('C19RM Budget'!A9:A154,'Budget Summary'!B8,'C19RM Budget'!P9:P154)","v":0},{"$f":"SUMIF('C19RM Budget'!A9:A154,'Budget Summary'!B8,'C19RM Budget'!Q9:Q154)","v":0},{"$f":"SUMIF('C19RM Budget'!A9:A154,'Budget Summary'!B8,'C19RM Budget'!R9:R154)","v":0},{"$f":"SUMIF('C19RM Budget'!A9:A154,'Budget Summary'!B8,'C19RM Budget'!S9:S154)","v":0},{"$f":"SUM(D8:H8)","v":0},{"$f":"SUMIF('C19RM Budget'!A9:A154,'Budget Summary'!B8,'C19RM Budget'!V9:V154)","v":0},{"$f":"I8+J8","v":0},{"$nulls":11},"Uncateg and EUR",{"$f":"IF(K10>0.1,IF(X6=\"EUR\",1,0),0)","v":0}]
[3,{"$f":"'C19RM Budget'!A17","v":"Improvements in health and comm. Syst"},"Improvements in health and community systems",{"$f":"SUMIF('C19RM Budget'!A9:A154,'Budget Summary'!B9,'C19RM Budget'!O9:O154)","v":0},{"$f":"SUMIF('C19RM Budget'!A9:A154,'Budget Summary'!B9,'C19RM Budget'!P9:P154)","v":0},{"$f":"SUMIF('C19RM Budget'!A9:A154,'Budget Summary'!B9,'C19RM Budget'!Q9:Q154)","v":0},{"$f":"SUMIF('C19RM Budget'!A9:A154,'Budget Summary'!B9,'C19RM Budget'!R9:R154)","v":0},{"$f":"SUMIF('C19RM Budget'!A9:A154,'Budget Summary'!B9,'C19RM Budget'!S9:S154)","v":0},0,{"$f":"SUMIF('C19RM Budget'!A9:A154,'Budget Summary'!B9,'C19RM Budget'!V9:V154)","v":0},{"$f":"I9+J9","v":0}]
[4,{"$f":"IF(K10>0,W11,\"\")","v":""},{"$f":"IF(L10>0,X11,\"\")","v":""},{"$f":"W3-D7-D8-D9","v":0},{"$f":"X3-E7-E8-E9","v":0},0,0,0,0,{"$f":"AB3-J9-J8-J7","v":0},{"$f":"I10+J10","v":0},{"$nulls":11},"sum of non-categorized",{"$f":"D10+E10+F10+G10+H10+J10","v":0}]
{"$rows_left_out":25}
{"sheet":"Free worksheet","index":5,"n_rows":0,"n_cols":0,"rows_kept":0,"cut":false,"hidden":false,"merged":[]}

{"sheet":"ctlgs","index":6,"n_rows":160,"n_cols":7,"rows_kept":160,"cut":false,"hidden":true,"merged":[]}
["AED",null,"Countries",null,"Interventions:"]
["AFN",null,"Afghanistan",null,"COVID-19 control and containment including health systems strengthening"]
["ALL",null,"Albania",null,"Risk mitigation for disease programs"]
["AMD",null,"Algeria"]
["ANG",null,"Angola"]
["AOA",null,"Armenia",null,"three categories of eligible programming supported by C19RM","Intervention mapping","Abbreviated category name"]
["ARS",null,"Azerbaijan",null,"Mitigating COVID-19 impact on HIV, TB, Malaria programs","Risk mitigation for disease programs","Mitigating impact of Covid-19"]
["AUD",null,"Bangladesh",null,"Reinforcing national COVID-19 response","COVID-19 control and containment including health systems strengthening","Reinforcing national response"]
["AWG",null,"Belarus",null,"Urgent improvements in health and community systems","COVID-19 control and containment including health systems strengthening","Improvements in health and comm. Syst"]
["AZN",null,"Belize"]
{"$rows_left_out":151}
{"sheet":"PRList","index":7,"n_rows":326,"n_cols":13,"rows_kept":326,"cut":false,"hidden":true,"merged":[]}
["PR GF Territory","PR","GrantNum","PR1","GrantNum",null,"IP","IP","grant statis","W"]
["Afghanistan","United Nations Development Programme - AFG-H-UNDP","AFG-H-UNDP","United Nations Development Programme","AFG-H-UNDP",null,"2018-01-01","2020-12-31","Active","NFM2",null,null,{"$f":"B2&\" - \"&E2","v":"United Nations Development Programme - AFG-H-UNDP - AFG-H-UNDP"}]
["Afghanistan","United Nations Development Programme - AFG-M-UNDP","AFG-M-UNDP","United Nations Development Programme","AFG-M-UNDP",null,"2018-01-01","2020-12-31","Active","NFM2",null,null,"United Nations Development Programme - AFG-M-UNDP - AFG-M-UNDP"]
["Afghanistan","Ministry of Public Health of the Islamic Republic of Afghanistan - AFG-T-MOPH","AFG-T-MOPH","Ministry of Public Health of the Islamic Republic of Afghanistan","AFG-T-MOPH",null,"2018-01-01","2020-12-31","Active","NFM2",null,null,"Ministry of Public Health of the Islamic Republic of Afghanistan - AFG-T-MOPH - AFG-T-MOPH"]
["Afghanistan","United Nations Development Programme - AFG-T-UNDP","AFG-T-UNDP","United Nations Development Programme","AFG-T-UNDP",null,"2018-01-01","2020-12-31","Active","NFM2",null,null,"United Nations Development Programme - AFG-T-UNDP - AFG-T-UNDP"]
["Albania","Ministry of Health of the Republic of Albania - ALB-C-MOH","ALB-C-MOH","Ministry of Health of the Republic of Albania","ALB-C-MOH",null,"2020-01-01","2022-12-31","Active","NFM2",null,null,"Ministry of Health of the Republic of Albania - ALB-C-MOH - ALB-C-MOH"]
["Algeria","Ministry of Health, Population and Hospital Reform of the People's Democratic Republic of Algeria - DZA-H-MOH","DZA-H-MOH","Ministry of Health, Population and Hospital Reform of the People's Democratic Republic of Algeria","DZA-H-MOH",null,"2020-01-01","2022-12-31","Active","NFM2",null,null,"Ministry of Health, Population and Hospital Reform of the People's Democratic Republic of Algeria - DZA-H-MOH - DZA-H-MOH"]
["Angola","United Nations Development Programme - AGO-H-UNDP","AGO-H-UNDP","United Nations Development Programme","AGO-H-UNDP",null,"2018-07-01","2021-06-30","Active","NFM2",null,null,"United Nations Development Programme - AGO-H-UNDP - AGO-H-UNDP"]
["Angola","Ministry of Health of the Republic of Angola - AGO-M-MOH","AGO-M-MOH","Ministry of Health of the Republic of Angola","AGO-M-MOH",null,"2018-07-01","2021-06-30","Active","NFM2",null,null,"Ministry of Health of the Republic of Angola - AGO-M-MOH - AGO-M-MOH"]
["Angola","World Vision International - AGO-M-WVI","AGO-M-WVI","World Vision International","AGO-M-WVI",null,"2018-07-01","2021-06-30","Active","NFM2",null,null,"World Vision International - AGO-M-WVI - AGO-M-WVI"]
{"$rows_left_out":316}